BDBM50277289 CHEMBL507114::N-(quinolin-8-yl)-6-(sulfamoylamino)hexanamide
SMILES NS(=O)(=O)NCCCCCC(=O)Nc1cccc2cccnc12
InChI Key InChIKey=IQEBALPYRTUOEG-UHFFFAOYSA-N
Data  2 IC50
  Tab Delimited (TSV)   2D SDfile   Computed 3D by Vconf -m prep SDfile
Find this compound or compounds like it in BindingDB:
Activity Spreadsheet -- Enzyme Inhibition Constant Data from BindingDB
Found 1 hit for monomerid = 50277289
TargetHistone deacetylase 1(Homo sapiens (Human))
Methylgene
Curated by ChEMBL
LigandPNGBDBM50277289(CHEMBL507114 | N-(quinolin-8-yl)-6-(sulfamoylamino...)
Affinity DataIC50: >1.00E+4nM. Assay description: Inhibition of human recombinant C-terminal FLAG-tagged HDAC1 expressed in baculovirus by fluorimetry
In DepthDetails ArticlePubMed